Reaction Details
TargetMacrophage metalloelastase
LigandBDBM120164
Substrate/Competitorn/a
Meas. Tech.Inhibition Assay
Ki 8.2±n/a nM
Citation Devel, LBeau, FCzarny, BDive, V Pseudodipeptides as MMP inhibitors US Patent US8691753 Publication Date 4/8/2014
 
Macrophage metalloelastase
Name:Macrophage metalloelastase
Type:Enzyme
Mol. Mass.:54012.99
Organism:Homo sapiens (Human)
Description:P39900
Residue:470
BDBM120164
NameBDBM120164
Synonyms:US8691753, 12
TypeSmall organic molecule
Emp. Form.C29H31ClN4O8
Mol. Mass.599.031
SMILESNC(=O)[C@H](CCCC(O)=O)NC(=O)[C@H](CCC(O)=O)NC(=O)CCc1cc(no1)-c1ccc(cc1)-c1cccc(Cl)c1