Reaction Details
TargetMacrophage metalloelastase
LigandBDBM120241
Substrate/Competitorn/a
Meas. Tech.Inhibition Assay
Ki 8±n/a nM
Citation Devel, LBeau, FCzarny, BDive, V Pseudodipeptides as MMP inhibitors US Patent US8691753 Publication Date 4/8/2014
 
Macrophage metalloelastase
Name:Macrophage metalloelastase
Type:Enzyme
Mol. Mass.:54012.99
Organism:Homo sapiens (Human)
Description:P39900
Residue:470
BDBM120241
NameBDBM120241
Synonyms:US8691753, 90
TypeSmall organic molecule
Emp. Form.C26H26N2O6S
Mol. Mass.494.559
SMILESOC(=O)CC[C@H](NC(=O)CCc1ccc(cc1)-c1cccs1)C(=O)Nc1cccc(CC(O)=O)c1