Reaction Details
TargetMacrophage metalloelastase
LigandBDBM120243
Substrate/Competitorn/a
Meas. Tech.Inhibition Assay
Ki 2.58±n/a nM
Citation Devel, LBeau, FCzarny, BDive, V Pseudodipeptides as MMP inhibitors US Patent US8691753 Publication Date 4/8/2014
 
Macrophage metalloelastase
Name:Macrophage metalloelastase
Type:Enzyme
Mol. Mass.:54012.99
Organism:Homo sapiens (Human)
Description:P39900
Residue:470
BDBM120243
NameBDBM120243
Synonyms:US8691753, 92
TypeSmall organic molecule
Emp. Form.C29H31N3O7S
Mol. Mass.565.637
SMILESNC(=O)[C@H](CCC(O)=O)NC(=O)[C@H](CCC(O)=O)NC(=O)CCc1ccc(cc1)-c1ccc(s1)-c1ccccc1