Reaction Details
TargetMacrophage metalloelastase
LigandBDBM120246
Substrate/Competitorn/a
Meas. Tech.Inhibition Assay
Ki 1.92±n/a nM
Citation Devel, LBeau, FCzarny, BDive, V Pseudodipeptides as MMP inhibitors US Patent US8691753 Publication Date 4/8/2014
 
Macrophage metalloelastase
Name:Macrophage metalloelastase
Type:Enzyme
Mol. Mass.:54012.99
Organism:Homo sapiens (Human)
Description:P39900
Residue:470
BDBM120246
NameBDBM120246
Synonyms:US8691753, 95 | US8691753, 96
TypeSmall organic molecule
Emp. Form.C29H31N3O7S
Mol. Mass.565.637
SMILESNC(=O)[C@H](CCC(O)=O)NC(=O)[C@H](CCC(O)=O)NC(=O)CCc1ccc(cc1)-c1cc(cs1)-c1ccccc1