Reaction Details
TargetAcetylcholinesterase
LigandBDBM120263
Substrate/Competitorn/a
Meas. Tech.Assay of Substrate Hydrolysis
pH7±n/a
Temperature298.15±n/a K
Ki 310±0.0 nM
Commentsextracted
Citation Beri, VWildman, SAShiomi, KAl-Rashid, ZFCheung, JRosenberry, TL The natural product dihydrotanshinone I provides a prototype for uncharged inhibitors that bind specifically to the acetylcholinesterase peripheral site with nanomolar affinity. Biochemistry52:7486-99 (2013) 
 
Acetylcholinesterase
Name:Acetylcholinesterase
Type:Enzyme
Mol. Mass.:68165.65
Organism:Mus musculus (mouse)
Description:n/a
Residue:614
BDBM120263
NameBDBM120263
Synonyms:N-methylacridinium
TypeSmall organic molecule
Emp. Form.C14H12N
Mol. Mass.194.2512
SMILESC[n+]1c2ccccc2cc2ccccc12