Reaction Details
TargetDihydroorotate dehydrogenase (quinone), mitochondrial
LigandBDBM120324
Substrate/Competitorn/a
Meas. Tech.Enzymatic Assays
IC50 42±n/a nM
Citation Bastos, CBooker, MLCelatka, CAClardy, JCCortese, JPatel, VPSkerlj, RWiegand, RCWirth, DF Small molecule inhibitors of Plasmodium falciparum dihydroorotate dehydrogenase US Patent US8703811 Publication Date 4/22/2014
 
Dihydroorotate dehydrogenase (quinone), mitochondrial
Name:Dihydroorotate dehydrogenase (quinone), mitochondrial
Type:Enzyme
Mol. Mass.:65581.88
Organism:Plasmodium falciparum
Description:His6-tag DHODH was expressed in E. coli.
Residue:569
BDBM120324
NameBDBM120324
Synonyms:US8703811, 65
TypeSmall organic molecule
Emp. Form.C17H17N3OS
Mol. Mass.311.401
SMILESCc1nc2c(C)cccc2n1-c1ccc(s1)C(=O)NC1CC1