Reaction Details
TargetDihydroorotate dehydrogenase (quinone), mitochondrial
LigandBDBM120328
Substrate/Competitorn/a
Meas. Tech.Enzymatic Assays
IC50 58±n/a nM
Citation Bastos, CBooker, MLCelatka, CAClardy, JCCortese, JPatel, VPSkerlj, RWiegand, RCWirth, DF Small molecule inhibitors of Plasmodium falciparum dihydroorotate dehydrogenase US Patent US8703811 Publication Date 4/22/2014
 
Dihydroorotate dehydrogenase (quinone), mitochondrial
Name:Dihydroorotate dehydrogenase (quinone), mitochondrial
Type:Enzyme
Mol. Mass.:65581.88
Organism:Plasmodium falciparum
Description:His6-tag DHODH was expressed in E. coli.
Residue:569
BDBM120328
NameBDBM120328
Synonyms:US8703811, 70
TypeSmall organic molecule
Emp. Form.C15H12FN3OS
Mol. Mass.301.339
SMILESFc1ccc2n(cnc2c1)-c1ccc(s1)C(=O)NC1CC1