Reaction Details
TargetCathepsin B
LigandBDBM120829
Substrate/Competitorn/a
Meas. Tech.Enzymatic activity assay
pH6±n/a
Temperature310.15±n/a K
Ki 0.113±0.011 nM
Commentsextracted
Citation Raghav, NGarg, S N-formylpyrazolines and N-benzoylpyrazolines as novel inhibitors of mammalian cathepsin B and cathepsin H. Bioorg Chem57:43-50 (2014) 
 
Cathepsin B
Name:Cathepsin B
Synonyms:n/a
Type:Protein
Mol. Mass.:36777.57
Organism:Capra hircus (Goat)
Description:n/a
Residue:335
BDBM120829
NameBDBM120829
Synonyms:N-formyl-5-(-4'-nitrophenyl)-3-phenylpyrazoline (1j)
TypeSmall organic molecule
Emp. Form.C16H13N3O3
Mol. Mass.295.2927
SMILES[O-][N+](=O)c1ccc(cc1)C1CC(=NN1C=O)c1ccccc1