Reaction Details
TargetCathepsin H
LigandBDBM120820
Substrate/Competitorn/a
Meas. Tech.Enzymatic activity assay
pH6±n/a
Temperature310.15±n/a K
Ki 1.74±0.174 nM
Commentsextracted
Citation Raghav, NGarg, S N-formylpyrazolines and N-benzoylpyrazolines as novel inhibitors of mammalian cathepsin B and cathepsin H. Bioorg Chem57:43-50 (2014) 
 
Cathepsin H
Name:Cathepsin H
Synonyms:n/a
Type:Protein
Mol. Mass.:37394.24
Organism:Capra hircus (Goat)
Description:A0A060INS8
Residue:335
BDBM120820
NameBDBM120820
Synonyms:N-formyl-3,5-diphenylpyrazoline (1a)
TypeSmall organic molecule
Emp. Form.C16H14N2O
Mol. Mass.250.2952
SMILESO=CN1N=C(CC1c1ccccc1)c1ccccc1