Reaction Details
TargetCathepsin H
LigandBDBM120823
Substrate/Competitorn/a
Meas. Tech.Enzymatic activity assay
pH6±n/a
Temperature310.15±n/a K
Ki 1.37±0.132 nM
Commentsextracted
Citation Raghav, NGarg, S N-formylpyrazolines and N-benzoylpyrazolines as novel inhibitors of mammalian cathepsin B and cathepsin H. Bioorg Chem57:43-50 (2014) 
 
Cathepsin H
Name:Cathepsin H
Synonyms:n/a
Type:Protein
Mol. Mass.:37394.24
Organism:Capra hircus (Goat)
Description:A0A060INS8
Residue:335
BDBM120823
NameBDBM120823
Synonyms:N-formyl-5-(-4'-chlorophenyl)-3-phenylpyrazoline (1d)
TypeSmall organic molecule
Emp. Form.C16H13ClN2O
Mol. Mass.284.74
SMILESClc1ccc(cc1)C1CC(=NN1C=O)c1ccccc1