Reaction Details
TargetcAMP-specific 3',5'-cyclic phosphodiesterase 4A
LigandBDBM120844
Substrate/Competitorn/a
Meas. Tech.Inhibition Assay
pH7.5±n/a
Temperature310.15±n/a K
IC50 5.2±n/a nM
Citation Jarnagin, KAkama, T Boron-containing small molecules US Patent US8716478 Publication Date 5/6/2014
 
cAMP-specific 3',5'-cyclic phosphodiesterase 4A
Name:cAMP-specific 3',5'-cyclic phosphodiesterase 4A
Type:Enzyme
Mol. Mass.:98113.27
Organism:Homo sapiens (Human)
Description:P27815
Residue:886
BDBM120844
NameBDBM120844
Synonyms:US8716478, D230 US9499570, D230
TypeSmall organic molecule
Emp. Form.C18H18BClN2O5
Mol. Mass.388.61
SMILESCC(C)OCCOc1nc(Oc2ccc3B(O)OCc3c2)c(Cl)cc1C#N