Reaction Details
TargetcAMP-specific 3',5'-cyclic phosphodiesterase 4A
LigandBDBM120857
Substrate/Competitorn/a
Meas. Tech.Inhibition Assay
pH7.5±n/a
Temperature310.15±n/a K
IC50 6.5±n/a nM
Citation Jarnagin, KAkama, T Boron-containing small molecules US Patent US8716478 Publication Date 5/6/2014
 
cAMP-specific 3',5'-cyclic phosphodiesterase 4A
Name:cAMP-specific 3',5'-cyclic phosphodiesterase 4A
Type:Enzyme
Mol. Mass.:98113.27
Organism:Homo sapiens (Human)
Description:P27815
Residue:886
BDBM120857
NameBDBM120857
Synonyms:US8716478, D243 | US9499570, D243
TypeSmall organic molecule
Emp. Form.C19H18BN3O5
Mol. Mass.379.174
SMILESCC(C)OCCOc1nc(Oc2ccc3B(O)OCc3c2)c(cc1C#N)C#N