Reaction Details
TargetCyclin-dependent kinase 9
LigandBDBM120942
Substrate/Competitorn/a
Meas. Tech.In Vitro Kinase Inhibition Assays
pH7.5±n/a
IC50 0.029±n/a nM
Commentsextracted
Citation Allgeier, HAugustin, MMüller, AZeitlmann, LMarquardt, APleiss, MAHeiser, UNiestroj, AJ Inhibitors of protein kinases US Patent US8716296 Publication Date 5/6/2014
 
Cyclin-dependent kinase 9
Name:Cyclin-dependent kinase 9
Type:Enzyme Subunit
Mol. Mass.:42789.13
Organism:Homo sapiens (Human)
Description:n/a
Residue:372
BDBM120942
NameBDBM120942
Synonyms:US8716296, 83
TypeSmall organic molecule
Emp. Form.C18H15FN4O2
Mol. Mass.338.3357
SMILESCOc1ccc(F)cc1-c1cc(NC(=O)Cc2ccncc2)ncn1