Reaction Details
TargetCathepsin S
LigandBDBM122498
Substrate/Competitorn/a
Meas. Tech.Enzyme Inhibition Assay
pH6.5±n/a
IC50 0.328±n/a nM
Citation Banner, DHaap, WKuhn, BLuebbers, TPeters, JSchulz-Gasch, T Pyrrolidine derivatives US Patent US8729061 Publication Date 5/20/2014
 
Cathepsin S
Name:Cathepsin S
Type:Protein
Mol. Mass.:37507.38
Organism:Homo sapiens (Human)
Description:P25774
Residue:331
BDBM122498
NameBDBM122498
Synonyms:US8729061, 28
TypeSmall organic molecule
Emp. Form.C30H33Cl2N3O6S
Mol. Mass.634.571
SMILESCC(C)[C@H](NC(=O)[C@@H]1C[C@H](CN1C(=O)C1(CC1)c1ccc(Cl)cc1)S(=O)(=O)c1ccccc1Cl)C(=O)C(=O)NC1CC1