Reaction Details
TargetCathepsin S
LigandBDBM122509
Substrate/Competitorn/a
Meas. Tech.Enzyme Inhibition Assay
pH6.5±n/a
IC50 0.558±n/a nM
Citation Banner, DHaap, WKuhn, BLuebbers, TPeters, JSchulz-Gasch, T Pyrrolidine derivatives US Patent US8729061 Publication Date 5/20/2014
 
Cathepsin S
Name:Cathepsin S
Type:Protein
Mol. Mass.:37507.38
Organism:Homo sapiens (Human)
Description:P25774
Residue:331
BDBM122509
NameBDBM122509
Synonyms:US8729061, 39
TypeSmall organic molecule
Emp. Form.C29H30Cl2FN3O6S
Mol. Mass.638.534
SMILESCC[C@H](NC(=O)[C@@H]1C[C@H](CN1C(=O)C1(CC1)c1ccc(Cl)cc1)S(=O)(=O)c1ccc(F)cc1Cl)C(=O)C(=O)NC1CC1