Reaction Details
TargetProcathepsin L
LigandBDBM122523
Substrate/Competitorn/a
Meas. Tech.Enzyme Inhibition Assay
pH6.5±n/a
IC50 1.7±n/a nM
Citation Banner, DHaap, WKuhn, BLuebbers, TPeters, JSchulz-Gasch, T Pyrrolidine derivatives US Patent US8729061 Publication Date 5/20/2014
 
Procathepsin L
Name:Procathepsin L
Type:Enzyme
Mol. Mass.:37557.19
Organism:Homo sapiens (Human)
Description:Purchased from Calbiochem (San Diego, CA).
Residue:333
BDBM122523
NameBDBM122523
Synonyms:US8729061, 53
TypeSmall organic molecule
Emp. Form.C31H35Cl2N3O7S
Mol. Mass.664.597
SMILESCC[C@H](NC(=O)[C@@H]1C[C@H](CN1C(=O)C1(CC1)c1ccc(Cl)cc1)S(=O)(=O)c1ccccc1Cl)C(=O)C(=O)NC1CCOCC1