Reaction Details
TargetProcathepsin L
LigandBDBM122528
Substrate/Competitorn/a
Meas. Tech.Enzyme Inhibition Assay
pH6.5±n/a
IC50 0.9±n/a nM
Citation Banner, DHaap, WKuhn, BLuebbers, TPeters, JSchulz-Gasch, T Pyrrolidine derivatives US Patent US8729061 Publication Date 5/20/2014
 
Procathepsin L
Name:Procathepsin L
Type:Enzyme
Mol. Mass.:37557.19
Organism:Homo sapiens (Human)
Description:Purchased from Calbiochem (San Diego, CA).
Residue:333
BDBM122528
NameBDBM122528
Synonyms:US8729061, 58
TypeSmall organic molecule
Emp. Form.C29H31Cl2FN4O6S
Mol. Mass.653.549
SMILESCC(C)[C@H](NC(=O)[C@@H]1C[C@H](CN1C(=O)C1(CC1)c1ncc(Cl)cc1F)S(=O)(=O)c1ccccc1Cl)C(=O)C(=O)NC1CC1