Reaction Details
TargetMuscarinic acetylcholine receptor M3
LigandBDBM123054
Substrate/Competitorn/a
Meas. Tech.Radioligand Binding Assay
Temperature295.15±n/a K
Ki 0.16±n/a nM
IC50 0.23±n/a nM
Commentsextracted
Citation Pfister, JRRescourio, GVenkatraman, MSZhang, X 7-azoniabicyclo[2.2.1]heptane derivatives, methods of production, and pharmaceutical uses thereof US Patent US8742134 Publication Date 6/3/2014
 
Muscarinic acetylcholine receptor M3
Name:Muscarinic acetylcholine receptor M3
Type:Enzyme
Mol. Mass.:66151.03
Organism:Homo sapiens (Human)
Description:P20309
Residue:590
BDBM123054
NameBDBM123054
Synonyms:US8742134, (1)
Typen/a
Emp. Form.C22H32NO2
Mol. Mass.342.4944
SMILESC[C@@](C1CCCC1)(C(=O)O[C@@H]1CC2CCC1[N+]2(C)C)c1ccccc1