Reaction Details
TargetUDP-N-acetylmuramate--L-alanine ligase
LigandBDBM123106
Substrate/Competitorn/a
Meas. Tech.P. aeruginosa MurC assay
Temperature298.15±0 K
IC50 1e+1±n/a nM
Citation Hameed P, SManjrekar, PChinnapattu, MHumnabadkar, VShanbhag, GKedari, CMudugal, NVAmbady, Ade Jonge, BLSadler, CPaul, BSriram, SKaur, PGuptha, SRaichurkar, AFleming, PEyermann, CJMcKinney, DCSambandamurthy, VKPanda, MRavishankar, S Pyrazolopyrimidines Establish MurC as a Vulnerable Target in Pseudomonas aeruginosa and Escherichia coli. ACS Chem Biol9:2274-82 (2014) 
 
UDP-N-acetylmuramate--L-alanine ligase
Name:UDP-N-acetylmuramate--L-alanine ligase
Type:Protein
Mol. Mass.:51977.96
Organism:Pseudomonas aeruginosa (G-proteobacteria)
Description:Q9HW02
Residue:480
BDBM123106
NameBDBM123106
Synonyms:(R)-2-cyclohexyl-2-(4-(3-isopropyl-1H-pyrazol-5-ylamino)-1H-pyrazolo[3,4-d]pyrimidin-6-ylamino)ethanol (5)
TypeSmall organic molecule
Emp. Form.C20H30N8O
Mol. Mass.398.5052
SMILESCC(C)(C)c1cc(Nc2nc(NC(CO)C3CCCCC3)nc3n[nH]cc23)[nH]n1