Reaction Details
TargetUDP-N-acetylmuramate--L-alanine ligase
LigandBDBM123109
Substrate/Competitorn/a
Meas. Tech.P. aeruginosa MurC assay
Temperature298.15±0 K
IC50 11±n/a nM
Citation Hameed P, SManjrekar, PChinnapattu, MHumnabadkar, VShanbhag, GKedari, CMudugal, NVAmbady, Ade Jonge, BLSadler, CPaul, BSriram, SKaur, PGuptha, SRaichurkar, AFleming, PEyermann, CJMcKinney, DCSambandamurthy, VKPanda, MRavishankar, S Pyrazolopyrimidines Establish MurC as a Vulnerable Target in Pseudomonas aeruginosa and Escherichia coli. ACS Chem Biol9:2274-82 (2014) 
 
UDP-N-acetylmuramate--L-alanine ligase
Name:UDP-N-acetylmuramate--L-alanine ligase
Type:Protein
Mol. Mass.:51977.96
Organism:Pseudomonas aeruginosa (G-proteobacteria)
Description:Q9HW02
Residue:480
BDBM123109
NameBDBM123109
Synonyms:2-(4-(5-tert-butyl-1-methyl-1H-pyrazol-3-ylamino)-1H-pyrazolo[3,4-d]pyrimidin-6-ylamino)-2-(tetrahydro-2H-pyran-4-yl)ethanol (8)
TypeSmall organic molecule
Emp. Form.C20H30N8O2
Mol. Mass.414.5046
SMILESCn1nc(Nc2nc(NC(CO)C3CCOCC3)nc3n[nH]cc23)cc1C(C)(C)C