Reaction Details
TargetUDP-N-acetylmuramate--L-alanine ligase
LigandBDBM123112
Substrate/Competitorn/a
Meas. Tech.E.coli MurC assay
Temperature298.15±0 K
IC50 11±n/a nM
Citation Hameed P, SManjrekar, PChinnapattu, MHumnabadkar, VShanbhag, GKedari, CMudugal, NVAmbady, Ade Jonge, BLSadler, CPaul, BSriram, SKaur, PGuptha, SRaichurkar, AFleming, PEyermann, CJMcKinney, DCSambandamurthy, VKPanda, MRavishankar, S Pyrazolopyrimidines Establish MurC as a Vulnerable Target in Pseudomonas aeruginosa and Escherichia coli. ACS Chem Biol9:2274-82 (2014) 
 
UDP-N-acetylmuramate--L-alanine ligase
Name:UDP-N-acetylmuramate--L-alanine ligase
Type:Protein
Mol. Mass.:53617.78
Organism:Escherichia coli
Description:P17952
Residue:491
BDBM123112
NameBDBM123112
Synonyms:(S)-2-(4-(5-tert-butyl-1-methyl-1H-pyrazol-3-ylamino)-1H-pyrazolo[3,4-d]pyrimidin-6-ylamino)-2-phenylethanol (11)
TypeSmall organic molecule
Emp. Form.C21H26N8O
Mol. Mass.406.4841
SMILESCn1nc(Nc2nc(N[C@H](CO)c3ccccc3)nc3n[nH]cc23)cc1C(C)(C)C