Reaction Details
TargetUDP-N-acetylmuramate--L-alanine ligase
LigandBDBM123119
Substrate/Competitorn/a
Meas. Tech.E.coli MurC assay
Temperature298.15±0 K
IC50 15±n/a nM
Citation Hameed P, SManjrekar, PChinnapattu, MHumnabadkar, VShanbhag, GKedari, CMudugal, NVAmbady, Ade Jonge, BLSadler, CPaul, BSriram, SKaur, PGuptha, SRaichurkar, AFleming, PEyermann, CJMcKinney, DCSambandamurthy, VKPanda, MRavishankar, S Pyrazolopyrimidines Establish MurC as a Vulnerable Target in Pseudomonas aeruginosa and Escherichia coli. ACS Chem Biol9:2274-82 (2014) 
 
UDP-N-acetylmuramate--L-alanine ligase
Name:UDP-N-acetylmuramate--L-alanine ligase
Type:Protein
Mol. Mass.:53617.78
Organism:Escherichia coli
Description:P17952
Residue:491
BDBM123119
NameBDBM123119
Synonyms:(R)-2-(4-(5-tert-butyl-1-methyl-1H-pyrazol-3-ylamino)-1H-pyrazolo[3,4-d]pyrimidin-6-ylamino)-2-(2-methoxypyridin-4-yl)ethanol (18)
TypeSmall organic molecule
Emp. Form.C21H27N9O2
Mol. Mass.437.4982
SMILESCOc1cc(ccn1)[C@H](CO)Nc1nc(Nc2cc(n(C)n2)C(C)(C)C)c2c[nH]nc2n1