Reaction Details
TargetHistone deacetylase 1
LigandBDBM124187
Substrate/Competitorn/a
Meas. Tech.Activity Assay
pH8±n/a
Temperature298.15±n/a K
IC50 8600±n/a nM
Commentsextracted
Citation Kozikowski, AButler, KVKalin, JH HDAC inhibitors and therapeutic methods of using same US Patent US8748451 Publication Date 6/10/2014
 
Histone deacetylase 1
Name:Histone deacetylase 1
Type:Enzyme
Mol. Mass.:55090.27
Organism:Homo sapiens (Human)
Description:Q13547
Residue:482
BDBM124187
NameBDBM124187
Synonyms:US8748451, 2
Typen/a
Emp. Form.C18H24N2O2
Mol. Mass.300.3954
SMILESONC(=O)CCCCCn1c2CCCCc2c2ccccc12