Reaction Details
TargetHistone deacetylase 6
LigandBDBM50331109
Substrate/Competitorn/a
Meas. Tech.Activity Assay
pH8±n/a
Temperature298.15±n/a K
IC50 62±n/a nM
Commentsextracted
Citation Kozikowski, AButler, KVKalin, JH HDAC inhibitors and therapeutic methods of using same US Patent US8748451 Publication Date 6/10/2014
 
Histone deacetylase 6
Name:Histone deacetylase 6
Type:Chromatin regulator; hydrolase; repressor
Mol. Mass.:131381.51
Organism:Homo sapiens (Human)
Description:Q9UBN7
Residue:1215
BDBM50331109
NameBDBM50331109
Synonyms:6-(9H-carbazol-9-yl)-N-hydroxyhexanamide US8748451, 1
TypeSmall organic molecule
Emp. Form.C18H20N2O2
Mol. Mass.296.3636
SMILESONC(=O)CCCCCn1c2ccccc2c2ccccc12