Reaction Details
TargetHistone deacetylase 6
LigandBDBM124187
Substrate/Competitorn/a
Meas. Tech.Activity Assay
pH8±n/a
Temperature298.15±n/a K
IC50 90±n/a nM
Commentsextracted
Citation Kozikowski, AButler, KVKalin, JH HDAC inhibitors and therapeutic methods of using same US Patent US8748451 Publication Date 6/10/2014
 
Histone deacetylase 6
Name:Histone deacetylase 6
Type:Chromatin regulator; hydrolase; repressor
Mol. Mass.:131381.51
Organism:Homo sapiens (Human)
Description:Q9UBN7
Residue:1215
BDBM124187
NameBDBM124187
Synonyms:US8748451, 2
Typen/a
Emp. Form.C18H24N2O2
Mol. Mass.300.3954
SMILESONC(=O)CCCCCn1c2CCCCc2c2ccccc12