Reaction Details
TargetHistone deacetylase 6
LigandBDBM124188
Substrate/Competitorn/a
Meas. Tech.Activity Assay
pH8±n/a
Temperature298.15±n/a K
IC50 550±n/a nM
Commentsextracted
Citation Kozikowski, AButler, KVKalin, JH HDAC inhibitors and therapeutic methods of using same US Patent US8748451 Publication Date 6/10/2014
 
Histone deacetylase 6
Name:Histone deacetylase 6
Type:Chromatin regulator; hydrolase; repressor
Mol. Mass.:131381.51
Organism:Homo sapiens (Human)
Description:Q9UBN7
Residue:1215
BDBM124188
NameBDBM124188
Synonyms:US8748451, 3 | US8748451, 7
Typen/a
Emp. Form.C18H25N3O2
Mol. Mass.315.41
SMILESCN1CCc2c(C1)n(CCCCCC(=O)NO)c1ccccc21