Reaction Details
TargetHematopoietic prostaglandin D synthase
LigandBDBM124925
Substrate/Competitorn/a
Meas. Tech.Inhibiting Action
pH8±n/a
IC50 27±n/a nM
Commentsextracted
Citation Urade, YKitade, MShigeno, KYamane, KTanaka, K Piperazine compound having a PGDS inhibitory effect US Patent US8765750 Publication Date 7/1/2014
 
Hematopoietic prostaglandin D synthase
Name:Hematopoietic prostaglandin D synthase
Type:Enzyme
Mol. Mass.:23341.07
Organism:Homo sapiens (Human)
Description:The protein was expressed in E. coli strain BL21(DE3) with an N-terminal 6-His tag.
Residue:199
BDBM124925
NameBDBM124925
Synonyms:US8765750, 10
TypeSmall organic molecule
Emp. Form.C28H37N7O2
Mol. Mass.503.6391
SMILESCC1C=CC=C1C(=O)N1CCN(CC1)C(=O)NC1CCN(CC1)c1ccc(CCCn2ccnn2)cc1