Reaction Details
TargetLysine-specific histone demethylase 1A
LigandBDBM50346864
Substrate/Competitorn/a
Meas. Tech.Biological Assay
pH7.5±n/a
Ki 2100±n/a nM
Commentsextracted
Citation Minucci, SMai, AMattevi, A Tranylcypromine derivatives as inhibitors of histone demethylases LSD1 and/or LSD2 US Patent US8765820 Publication Date 7/1/2014
 
Lysine-specific histone demethylase 1A
Name:Lysine-specific histone demethylase 1A
Type:Enzyme
Mol. Mass.:92901.01
Organism:Homo sapiens (Human)
Description:O60341
Residue:852
BDBM50346864
NameBDBM50346864
Synonyms:CHEMBL1797641 US8765820, 8
TypeSmall organic molecule
Emp. Form.C26H27N3O3
Mol. Mass.429.5109
SMILESNC1CC1c1ccc(NC(=O)C(Cc2ccccc2)NC(=O)OCc2ccccc2)cc1