Reaction Details
TargetcAMP and cAMP-inhibited cGMP 3',5'-cyclic phosphodiesterase 10A
LigandBDBM125564
Substrate/Competitorn/a
Meas. Tech.Homogenous Time-Resolved Fluorescence Resonance Energy Transfer Assay
pH7.4±n/a
IC50 11±n/a nM
Commentsextracted
Citation Leblond, BDonello, JEChauvignac, CTaverne, TBeausoleil, ECasagrande, ADésiré, LPando, MPYang, R Substituted 6,7-dialkoxy-3-isoquinolinol derivatives as inhibitors of phosphodiesterase 10 (PDE10A) US Patent US8772316 Publication Date 7/8/2014
 
cAMP and cAMP-inhibited cGMP 3',5'-cyclic phosphodiesterase 10A
Name:cAMP and cAMP-inhibited cGMP 3',5'-cyclic phosphodiesterase 10A
Type:Protein
Mol. Mass.:88412.52
Organism:Homo sapiens (Human)
Description:Q9Y233
Residue:1055
BDBM125564
NameBDBM125564
Synonyms:US8772316, 47
TypeSmall organic molecule
Emp. Form.C27H31N3O4
Mol. Mass.461.5527
SMILESCCNc1nc2ccc(OC)cc2cc1Cc1c2cc(OC)c(OC)cc2c([nH]c1=O)C(C)C