Reaction Details
TargetcAMP and cAMP-inhibited cGMP 3',5'-cyclic phosphodiesterase 10A
LigandBDBM125604
Substrate/Competitorn/a
Meas. Tech.Homogenous Time-Resolved Fluorescence Resonance Energy Transfer Assay
pH7.4±n/a
IC50 3.9±n/a nM
Commentsextracted
Citation Leblond, BDonello, JEChauvignac, CTaverne, TBeausoleil, ECasagrande, ADésiré, LPando, MPYang, R Substituted 6,7-dialkoxy-3-isoquinolinol derivatives as inhibitors of phosphodiesterase 10 (PDE10A) US Patent US8772316 Publication Date 7/8/2014
 
cAMP and cAMP-inhibited cGMP 3',5'-cyclic phosphodiesterase 10A
Name:cAMP and cAMP-inhibited cGMP 3',5'-cyclic phosphodiesterase 10A
Type:Protein
Mol. Mass.:88412.52
Organism:Homo sapiens (Human)
Description:Q9Y233
Residue:1055
BDBM125604
NameBDBM125604
Synonyms:US8772316, 87
TypeSmall organic molecule
Emp. Form.C31H36N4O5
Mol. Mass.544.6413
SMILESCCc1[nH]c(=O)c(Cc2cc3cc(OCC4CC4)ccc3nc2NCCNC(C)=O)c2cc(OC)c(OC)cc12