Reaction Details
TargetTyrosine-protein kinase JAK2
LigandBDBM125902
Substrate/Competitorn/a
Meas. Tech.In Vitro Kinase Assay
pH7.8±n/a
Temperature298.15±n/a K
IC50 1.9±n/a nM
Commentsextracted
Citation Combs, APSparks, RBYue, EWFeng, HBower, MJZhu, W Macrocyclic compounds and their use as kinase inhibitors US Patent US8765727 Publication Date 7/1/2014
 
Tyrosine-protein kinase JAK2
Name:Tyrosine-protein kinase JAK2
Type:Protein
Mol. Mass.:130684.68
Organism:Homo sapiens (Human)
Description:O60674
Residue:1132
BDBM125902
NameBDBM125902
Synonyms:US8765727, 5
TypeSmall organic molecule
Emp. Form.C20H19ClN4O
Mol. Mass.366.844
SMILESClc1cnc2Nc3cccc(CCCOc4cccc(CNc1n2)c4)c3