Reaction Details
TargetTyrosine-protein kinase JAK3
LigandBDBM125913
Substrate/Competitorn/a
Meas. Tech.In Vitro Kinase Assay
pH7.8±n/a
Temperature298.15±n/a K
IC50 15±n/a nM
Commentsextracted
Citation Combs, APSparks, RBYue, EWFeng, HBower, MJZhu, W Macrocyclic compounds and their use as kinase inhibitors US Patent US8765727 Publication Date 7/1/2014
 
Tyrosine-protein kinase JAK3
Name:Tyrosine-protein kinase JAK3
Type:Protein
Mol. Mass.:125111.08
Organism:Homo sapiens (Human)
Description:P52333
Residue:1124
BDBM125913
NameBDBM125913
Synonyms:US8765727, 16
TypeSmall organic molecule
Emp. Form.C20H18BrClN4O
Mol. Mass.445.74
SMILESClc1cnc2Nc3cccc(CCCOc4cc(Br)cc(CNc1n2)c4)c3