Reaction Details
TargetNon-receptor tyrosine-protein kinase TYK2
LigandBDBM125902
Substrate/Competitorn/a
Meas. Tech.TYK2 Assay
IC50 25±n/a nM
Citation Combs, APSparks, RBYue, EWFeng, HBower, MJZhu, W Macrocyclic compounds and their use as kinase inhibitors US Patent US8765727 Publication Date 7/1/2014
 
Non-receptor tyrosine-protein kinase TYK2
Name:Non-receptor tyrosine-protein kinase TYK2
Type:Protein
Mol. Mass.:133666.03
Organism:Homo sapiens (Human)
Description:P29597
Residue:1187
BDBM125902
NameBDBM125902
Synonyms:US8765727, 5
TypeSmall organic molecule
Emp. Form.C20H19ClN4O
Mol. Mass.366.844
SMILESClc1cnc2Nc3cccc(CCCOc4cccc(CNc1n2)c4)c3