Reaction Details
TargetDimer of Gag-Pol polyprotein [489-587]
LigandBDBM4687
Substrate/CompetitorBDBM4685
Meas. Tech.Kinetic Competitive Displacement Assay
pH5.5±n/a
Temperature303.15±n/a K
Ki 0.00024±n/a nM
CommentsKi=r*KiGW0385. The r is determined atequilibrium from measured [E[3H]GW0385] and total concentrationsof E, [3H]GW0385, and inhibitor compound.
Citation Hanlon, MHPorter, DJFurfine, ESSpaltenstein, ACarter, HLDanger, DShu, AYKaldor, IWMiller, JFSamano, VA Inhibition of wild-type and mutant human immunodeficiency virus type 1 proteases by GW0385 and other arylsulfonamides. Biochemistry43:14500-7 (2004) 
 
Dimer of Gag-Pol polyprotein [489-587]
Name:Dimer of Gag-Pol polyprotein [489-587]
Synonyms:HIV-1 Protease
Type:Protein Complex
Mol. Mass.:n/a
Description:n/a
Components:This complex has 2 components.
Component 1
Name:Gag-Pol polyprotein [489-587]
Type:Enzyme Subunit
Mol. Mass.:10822.21
Organism:Human immunodeficiency virus type 1
Description:P12497[489-587]
Residue:99
Component 2
Name:Gag-Pol polyprotein [489-587]
Synonyms:HIV protease HIV-1 Protease chain A POL_HV1N5 | gag-pol
Type:Enzyme Subunit
Mol. Mass.:10822.21
Organism:Human immunodeficiency virus type 1
Description:P12497[489-587]
Residue:99
BDBM4687
BDBM4685
NameBDBM4687
Synonyms:(3R,3aS,6aR)-hexahydrofuro[2,3-b]furan-3-yl N-[(2S,3R)-4-[2H-1,3-benzodioxole-5-({2,2-dimethyl-5-[(methylcarbamoyl)oxy]pentyl})sulfonamido]-3-hydroxy-1-phenylbutan-2-yl]carbamate | GW0385 analog 2
TypeSmall organic molecule
Emp. Form.C33H45N3O11S
Mol. Mass.691.789
SMILES[H][C@@]12CCO[C@]1([H])OC[C@@H]2OC(=O)N[C@@H](Cc1ccccc1)[C@H](O)CN(CC(C)(C)CCCOC(=O)NC)S(=O)(=O)c1ccc2OCOc2c1