Reaction Details
TargetDimer of Gag-Pol polyprotein [489-587,I539V]
LigandBDBM4688
Substrate/CompetitorBDBM4685
Meas. Tech.Kinetic Competitive Displacement Assay
pH5.5±n/a
Temperature303.15±n/a K
Ki 0.0046±n/a nM
CommentsKi=r*KiGW0385. The r is calculated as k-1,compound/k-1,GW0385 assuming thatk1,compound = k1,GW0385.
Citation Hanlon, MHPorter, DJFurfine, ESSpaltenstein, ACarter, HLDanger, DShu, AYKaldor, IWMiller, JFSamano, VA Inhibition of wild-type and mutant human immunodeficiency virus type 1 proteases by GW0385 and other arylsulfonamides. Biochemistry43:14500-7 (2004) 
 
Dimer of Gag-Pol polyprotein [489-587,I539V]
Name:Dimer of Gag-Pol polyprotein [489-587,I539V]
Synonyms:HIV-1 Protease Mutant (I50V)
Type:Protein Complex
Mol. Mass.:n/a
Description:n/a
Components:This complex has 2 components.
Component 1
Name:Gag-Pol polyprotein [489-587,I539V]
Type:Enzyme Subunit
Mol. Mass.:10767.13
Organism:Human immunodeficiency virus type 1
Description:P04585[489-587,I539V]
Residue:99
Component 2
Name:Gag-Pol polyprotein [489-587,I539V]
Synonyms:HIV-1 Protease Mutant (I50V) HIV-1 Protease Mutant (I50V) Chain B gag-pol
Type:Enzyme Subunit
Mol. Mass.:10767.13
Organism:Human immunodeficiency virus type 1
Description:P04585[489-587,I539V]
Residue:99
BDBM4688
BDBM4685
NameBDBM4688
Synonyms:(3R,3aS,6aR)-hexahydrofuro[2,3-b]furan-3-yl N-[(2S,3R)-4-[2H-1,3-benzodioxole-5-({6-[(ethoxycarbonyl)amino]-2,2-dimethylhexyl})sulfonamido]-3-hydroxy-1-phenylbutan-2-yl]carbamate | GW0385 analog 3
TypeSmall organic molecule
Emp. Form.C35H49N3O11S
Mol. Mass.719.842
SMILES[H][C@@]12CCO[C@]1([H])OC[C@@H]2OC(=O)N[C@@H](Cc1ccccc1)[C@H](O)CN(CC(C)(C)CCCCNC(=O)OCC)S(=O)(=O)c1ccc2OCOc2c1