Reaction Details
TargetCyclin-T1
LigandBDBM126484
Substrate/Competitorn/a
Meas. Tech.IMAP Assay
IC50 0.001±n/a nM
Citation Barsanti, PAHu, CJin, JKeyes, RKucejko, RLin, XPan, YPfister, KBSendzik, MSutton, JWan, L Heteroaryl compounds and their uses US Patent US8778951 Publication Date 7/15/2014
 
Cyclin-T1
Name:Cyclin-T1
Type:Enzyme Subunit
Mol. Mass.:80712.40
Organism:Homo sapiens (Human)
Description:n/a
Residue:726
BDBM126484
NameBDBM126484
Synonyms:US8778951, 294
TypeSmall organic molecule
Emp. Form.C26H37ClFN5O2
Mol. Mass.506.056
SMILESCOC[C@@H](C)N[C@H]1CC[C@@H](CC1)Nc1cc(c(Cl)cn1)-c1ccc(F)c(NCC2CCOCC2)n1