Reaction Details
TargetProstaglandin D2 receptor 2
LigandBDBM127157
Substrate/Competitorn/a
Meas. Tech.Radioligand Binding Assay
pH7.4±n/a
Ki 1.2±n/a nM
Commentsextracted
Citation Oost, TAnderskewitz, RHamprecht, DWHoenke, CMartyres, DRist, WSeither, P Pyrazole compounds as CRTH2 antagonists US Patent US8791272 Publication Date 7/29/2014
 
Prostaglandin D2 receptor 2
Name:Prostaglandin D2 receptor 2
Type:Enzyme
Mol. Mass.:43295.45
Organism:Homo sapiens (Human)
Description:Q9Y5Y4
Residue:395
BDBM127157
NameBDBM127157
Synonyms:US8791272, 2.11
TypeSmall organic molecule
Emp. Form.C27H22F3N3O3
Mol. Mass.493.4771
SMILESCc1c(CC(O)=O)c(nn1Cc1ccc(NC(=O)c2ccc(cc2)C(F)(F)F)cc1)-c1ccccc1