Reaction Details
TargetProstaglandin D2 receptor 2
LigandBDBM127172
Substrate/Competitorn/a
Meas. Tech.Radioligand Binding Assay
pH7.4±n/a
Ki 0.6±n/a nM
Commentsextracted
Citation Oost, TAnderskewitz, RHamprecht, DWHoenke, CMartyres, DRist, WSeither, P Pyrazole compounds as CRTH2 antagonists US Patent US8791272 Publication Date 7/29/2014
 
Prostaglandin D2 receptor 2
Name:Prostaglandin D2 receptor 2
Type:Enzyme
Mol. Mass.:43295.45
Organism:Homo sapiens (Human)
Description:Q9Y5Y4
Residue:395
BDBM127172
NameBDBM127172
Synonyms:US8791272, 2.49
TypeSmall organic molecule
Emp. Form.C25H26ClN3O3
Mol. Mass.451.945
SMILESCCc1nn(Cc2ccc(NC(=O)c3ccc(Cl)cc3C)cc2)c(C2CC2)c1CC(O)=O