Reaction Details
TargetProstaglandin D2 receptor 2
LigandBDBM127245
Substrate/Competitorn/a
Meas. Tech.Radioligand Binding Assay
pH7.4±n/a
Ki 0.9±n/a nM
Commentsextracted
Citation Oost, TAnderskewitz, RHamprecht, DWHoenke, CMartyres, DRist, WSeither, P Pyrazole compounds as CRTH2 antagonists US Patent US8791272 Publication Date 7/29/2014
 
Prostaglandin D2 receptor 2
Name:Prostaglandin D2 receptor 2
Type:Enzyme
Mol. Mass.:43295.45
Organism:Homo sapiens (Human)
Description:Q9Y5Y4
Residue:395
BDBM127245
NameBDBM127245
Synonyms:US8791272, 9.13
TypeSmall organic molecule
Emp. Form.C24H23ClF3N3O3
Mol. Mass.493.906
SMILESCCc1nn(Cc2ccc(cc2)C(=O)Nc2ccc(Cl)c(c2)C(F)(F)F)c(CC)c1CC(O)=O