Reaction Details
TargetNeuraminidase
LigandBDBM4706
Substrate/CompetitorBDBM4702
Meas. Tech.Neuraminidase Inhibition Assay
pH6.5±n/a
Temperature310.15±n/a K
IC50 13000±n/a nM
Citation Chand, PBabu, YSBantia, SChu, NCole, LBKotian, PLLaver, WGMontgomery, JAPathak, VPPetty, SLShrout, DPWalsh, DAWalsh, GM Design and synthesis of benzoic acid derivatives as influenza neuraminidase inhibitors using structure-based drug design. J Med Chem40:4030-52 (1997) 
 
Neuraminidase
Name:Neuraminidase
Type:Enzyme
Mol. Mass.:52468.81
Organism:Influenza A virus (N9)
Description:P03472
Residue:470
BDBM4706
BDBM4702
NameBDBM4706
Synonyms:(2R,3R,4S)-3-acetamido-4-hydroxy-2-[(1R,2R)-1,2,3-trihydroxypropyl]-3,4-dihydro-2H-pyran-6-carboxylic acid CHEMBL96712 Neu5Ac2en
TypeSmall organic molecule
Emp. Form.C11H17NO8
Mol. Mass.291.2546
SMILESCC(=O)N[C@@H]1[C@@H](O)C=C(O[C@H]1[C@H](O)[C@H](O)CO)C(O)=O