Reaction Details
TargetPhosphatidylinositol 4,5-bisphosphate 3-kinase catalytic subunit alpha isoform
LigandBDBM50428108
Substrate/Competitorn/a
Meas. Tech.Biochemical Assay
pH7.4±n/a
Temperature298.15±n/a K
Ki 0.721±n/a nM
Commentsextracted
Citation Cheng, HJohnson, TWHoffman, JEGuo, LCLiu, Z Imidazo[1,5]naphthyridine compounds, their pharmaceutical use and compositions US Patent US8791131 Publication Date 7/29/2014
 
Phosphatidylinositol 4,5-bisphosphate 3-kinase catalytic subunit alpha isoform
Name:Phosphatidylinositol 4,5-bisphosphate 3-kinase catalytic subunit alpha isoform
Type:Enzyme Subunit
Mol. Mass.:124294.87
Organism:Homo sapiens (Human)
Description:P42336
Residue:1068
BDBM50428108
NameBDBM50428108
Synonyms:CHEMBL2331669 | US8791131, 255
TypeSmall organic molecule
Emp. Form.C25H25N7O3
Mol. Mass.471.5111
SMILESC[C@H](O)C(=O)N1CCC(CC1)n1c2c(cnc3ccc(nc23)-c2cccc3[nH]ncc23)n(C)c1=O