Reaction Details
TargetSerine/threonine-protein kinase mTOR
LigandBDBM127363
Substrate/Competitorn/a
Meas. Tech.Biochemical Assay
pH7.5±n/a
Temperature298.15±n/a K
Ki 7.9±n/a nM
Commentsextracted
Citation Cheng, HJohnson, TWHoffman, JEGuo, LCLiu, Z Imidazo[1,5]naphthyridine compounds, their pharmaceutical use and compositions US Patent US8791131 Publication Date 7/29/2014
 
Serine/threonine-protein kinase mTOR
Name:Serine/threonine-protein kinase mTOR
Type:Rapamycin target protein
Mol. Mass.:288917.12
Organism:Homo sapiens (Human)
Description:P42345
Residue:2549
BDBM127363
NameBDBM127363
Synonyms:US8791131, 121
TypeSmall organic molecule
Emp. Form.C27H26N6O2
Mol. Mass.466.5343
SMILESCCC(=O)N1CCC(CC1)n1c2c(cnc3ccc(nc23)-c2cnc3ccccc3c2)n(C)c1=O