Reaction Details
TargetLeucine-rich repeat serine/threonine-protein kinase 2
LigandBDBM128246
Substrate/Competitorn/a
Meas. Tech.Lanthascreen Binding Assay
Ki 3±n/a nM
Citation Baker-Glenn, CChambers, MChan, BKEstrada, ASweeney, ZK Aminopyrimidine derivatives as LRRK2 modulators US Patent US8796296 Publication Date 8/5/2014
 
Leucine-rich repeat serine/threonine-protein kinase 2
Name:Leucine-rich repeat serine/threonine-protein kinase 2
Type:Protein
Mol. Mass.:286113.20
Organism:Homo sapiens (Human)
Description:Q5S007
Residue:2527
BDBM128246
NameBDBM128246
Synonyms:US8796296, 1
TypeSmall organic molecule
Emp. Form.C16H15ClF3N5O2
Mol. Mass.401.771
SMILESCNc1nc(Nc2cc3OCCN(C)C(=O)c3cc2Cl)ncc1C(F)(F)F