Reaction Details
TargetLeucine-rich repeat serine/threonine-protein kinase 2
LigandBDBM128274
Substrate/Competitorn/a
Meas. Tech.Lanthascreen Binding Assay
Ki 1±n/a nM
Citation Baker-Glenn, CChambers, MChan, BKEstrada, ASweeney, ZK Aminopyrimidine derivatives as LRRK2 modulators US Patent US8796296 Publication Date 8/5/2014
 
Leucine-rich repeat serine/threonine-protein kinase 2
Name:Leucine-rich repeat serine/threonine-protein kinase 2
Type:Protein
Mol. Mass.:286113.20
Organism:Homo sapiens (Human)
Description:Q5S007
Residue:2527
BDBM128274
NameBDBM128274
Synonyms:US8796296, 30
TypeSmall organic molecule
Emp. Form.C21H23F3N6O3
Mol. Mass.464.4409
SMILESCNc1nc(Nc2cc3n(C)cc(C(=O)N4CCOCC4)c3cc2OC)ncc1C(F)(F)F