Reaction Details
TargetNeuraminidase
LigandBDBM4741
Substrate/CompetitorBDBM4702
Meas. Tech.Neuraminidase Inhibition Assay
pH6.5±n/a
Temperature310.15±n/a K
IC50 9900±n/a nM
Citation Chand, PBabu, YSBantia, SRowland, SDehghani, AKotian, PLHutchison, TLAli, SBrouillette, WEl-Kattan, YLin, TH Syntheses and neuraminidase inhibitory activity of multisubstituted cyclopentane amide derivatives. J Med Chem47:1919-29 (2004) 
 
Neuraminidase
Name:Neuraminidase
Type:Enzyme
Mol. Mass.:52468.81
Organism:Influenza A virus (N9)
Description:P03472
Residue:470
BDBM4741
BDBM4702
NameBDBM4741
Synonyms:(3S,4S)-3-[(S)-(butylcarbamoyl)(acetamido)methyl]-4-carbamimidamidocyclopentane-1-carboxylic acid | Cyclopentane Amide deriv. 14d
TypeSmall organic molecule
Emp. Form.C15H27N5O4
Mol. Mass.341.406
SMILES[#6]-[#6]-[#6]-[#6]-[#7]-[#6](=O)-[#6](-[#7]-[#6](-[#6])=O)-[#6@H]-1-[#6]-[#6](-[#6]-[#6@@H]-1\[#7]=[#6](\[#7])-[#7])-[#6](-[#8])=O