Reaction Details
TargetNeuraminidase
LigandBDBM4743
Substrate/CompetitorBDBM4702
Meas. Tech.Neuraminidase Inhibition Assay
pH6.5±n/a
Temperature310.15±n/a K
IC50 80±n/a nM
Citation Chand, PBabu, YSBantia, SRowland, SDehghani, AKotian, PLHutchison, TLAli, SBrouillette, WEl-Kattan, YLin, TH Syntheses and neuraminidase inhibitory activity of multisubstituted cyclopentane amide derivatives. J Med Chem47:1919-29 (2004) 
 
Neuraminidase
Name:Neuraminidase
Type:Enzyme
Mol. Mass.:52468.81
Organism:Influenza A virus (N9)
Description:P03472
Residue:470
BDBM4743
BDBM4702
NameBDBM4743
Synonyms:(3S,4S)-3-carbamimidamido-4-[(S)-acetamido(pentan-3-ylcarbamoyl)methyl]cyclopentane-1-carboxylic acid | Cyclopentane Amide deriv. 14f
TypeSmall organic molecule
Emp. Form.C16H29N5O4
Mol. Mass.355.4326
SMILES[#6]-[#6]-[#6](-[#6]-[#6])-[#7]-[#6](=O)-[#6](-[#7]-[#6](-[#6])=O)-[#6@H]-1-[#6]-[#6](-[#6]-[#6@@H]-1\[#7]=[#6](\[#7])-[#7])-[#6](-[#8])=O