Reaction Details
TargetNeuraminidase
LigandBDBM4749
Substrate/CompetitorBDBM4702
Meas. Tech.Neuraminidase Inhibition Assay
IC50 12500±n/a nM
Citation Chand, PBabu, YSBantia, SRowland, SDehghani, AKotian, PLHutchison, TLAli, SBrouillette, WEl-Kattan, YLin, TH Syntheses and neuraminidase inhibitory activity of multisubstituted cyclopentane amide derivatives. J Med Chem47:1919-29 (2004) 
 
Neuraminidase
Name:Neuraminidase
Type:Enzyme
Mol. Mass.:51446.67
Organism:Influenza B virus (B/Lee/40)
Description:n/a
Residue:466
BDBM4749
BDBM4702
NameBDBM4749
Synonyms:(3S,4S)-3-carbamimidamido-4-[(S)-acetamido[(4-phenylbutan-2-yl)carbamoyl]methyl]cyclopentane-1-carboxylic acid | Cyclopentane Amide deriv. 14l
TypeSmall organic molecule
Emp. Form.C21H31N5O4
Mol. Mass.417.5019
SMILES[#6]-[#6](-[#6]-[#6]-c1ccccc1)-[#7]-[#6](=O)-[#6](-[#7]-[#6](-[#6])=O)-[#6@H]-1-[#6]-[#6](-[#6]-[#6@@H]-1\[#7]=[#6](\[#7])-[#7])-[#6](-[#8])=O