Reaction Details
TargetFibroblast growth factor receptor 3
LigandBDBM128695
Substrate/Competitorn/a
Meas. Tech.In Vitro Kinase Inhibition Assay
pH8±n/a
Temperature298.15±n/a K
IC50 0.99±n/a nM
Commentsextracted
Citation Berdini, VCarr, MGCongreve, MSFrederickson, MGriffiths-Jones, CMHamlett, CCMadin, AMurray, CWBenning, RKSaxty, GVickerstaffe, EWilliams, BJWoodhead, AJWoodhead, SJFreyne, EJGovaerts, TCAngibaud, PR Imidazopyridine derivatives as inhibitors of receptor tyrosine kinases US Patent US8796244 Publication Date 8/5/2014
 
Fibroblast growth factor receptor 3
Name:Fibroblast growth factor receptor 3
Type:Protein
Mol. Mass.:87699.57
Organism:Homo sapiens (Human)
Description:P22607
Residue:806
BDBM128695
NameBDBM128695
Synonyms:US8796244, 289
TypeSmall organic molecule
Emp. Form.C23H17F3N8OS
Mol. Mass.510.494
SMILESFC(F)(F)CNC(=O)Nc1cccc(c1)-c1cnc2cc(ccn12)-c1nnc(Nc2cccnc2)s1