Reaction Details
TargetTransient receptor potential cation channel subfamily V member 1
LigandBDBM128851
Substrate/Competitorn/a
Meas. Tech.FLIPR Assay
IC50 5±n/a nM
Citation Gomtsyan, ADaanen, JFGfesser, GAKort, MELee, CMcDonald, HAPuttfarcken, PSVoight, EAKym, PR TRPV1 antagonists US Patent US8802711 Publication Date 8/12/2014
 
Transient receptor potential cation channel subfamily V member 1
Name:Transient receptor potential cation channel subfamily V member 1
Type:Protein
Mol. Mass.:94960.75
Organism:Homo sapiens (Human)
Description:Q8NER1
Residue:839
BDBM128851
NameBDBM128851
Synonyms:US8802711, 20
TypeSmall organic molecule
Emp. Form.C22H22FN3O
Mol. Mass.363.428
SMILESCc1cc2c(NC(=O)N[C@@H]3CC[C@H](C3)c3ccccc3)c(F)ccc2cn1