Reaction Details
TargetTransient receptor potential cation channel subfamily V member 1
LigandBDBM128977
Substrate/Competitorn/a
Meas. Tech.FLIPR Assay
IC50 6±n/a nM
Citation Gomtsyan, ADaanen, JFGfesser, GAKort, MELee, CMcDonald, HAPuttfarcken, PSVoight, EAKym, PR TRPV1 antagonists US Patent US8802711 Publication Date 8/12/2014
 
Transient receptor potential cation channel subfamily V member 1
Name:Transient receptor potential cation channel subfamily V member 1
Type:Protein
Mol. Mass.:94960.75
Organism:Homo sapiens (Human)
Description:Q8NER1
Residue:839
BDBM128977
NameBDBM128977
Synonyms:US8802711, B
TypeSmall organic molecule
Emp. Form.C22H26N2O2
Mol. Mass.350.454
SMILESO[C@H]1CCc2cccc(NC(=O)N[C@H]3CC[C@H](C3)c3ccccc3)c2C1